Movatterモバイル変換


[0]ホーム

URL:


Country
Contact Sales

Bug Fixes

The following table lists the bug fixes included in JDK 8u60 release:

Bug IdCategorySubcategoryDescription
JDK-8075244client-libs [macosx] The fix for JDK-8043869 should be reworked
JDK-8077518client-libs XMLParserTest unit test failure.
JDK-8077982client-libs GIFLIB upgrade
JDK-8078654client-libs CloseTTFontFileFunc callback should be removed
JDK-8081315client-libs 8077982 giflib upgrade breaks system giflib builds with earlier versions
JDK-8129116client-libs Deadlock with multimonitor fullscreen windows.
JDK-7145508client-libs [embedded] java.awt.GraphicsDevice.get/setDisplayMode behavior is incorrect when no display is present
JDK-8017773client-libs2dOpenJDK7 returns incorrect TrueType font metrics
JDK-8023794client-libs2d[macosx] LCD Rendering hints seems not working without FRACTIONALMETRICS=ON
JDK-8035371client-libs2dgcc compiler warnings in closed source code
JDK-8036930client-libs2dType1 font not loaded by java.awt.Font.createFont
JDK-8061831client-libs2d[OGL] "java.lang.InternalError: not implemented yet" during the blit of VI to VI in xor mode
JDK-8064833client-libs2d[macosx] Native font lookup uses family+style, not full name/postscript name
JDK-8066132client-libs2dBufferedImage::getPropertyNames() always returns null
JDK-8067364client-libs2dPrinting to Postscript doesn't support dieresis
JDK-8071710client-libs2d[solaris] libfontmanager should be linked against headless awt library
JDK-8073001client-libs2dJava's system LnF on OS X: editable JComboBoxes are being rendered incorrectly
JDK-8076419client-libs2dPath2D copy constructors and clone method propagate size of arrays from source path
JDK-8078331client-libs2dUpgrade JDK to use LittleCMS 2.7
JDK-8078464client-libs2dPath2D storage growth algorithms should be less linear
JDK-8079652client-libs2dCould not enable D3D pipeline
JDK-8085910client-libs2dOGL text renderer: gamma lut cleanup
JDK-8104577client-libsdemoRemove debugging message from Font2DTest demo
JDK-6475361client-libsjava.awtAttempting to remove help menu from java.awt.MenuBar throws NullPointerException
JDK-7155963client-libsjava.awtDeadlock in SystemFlavorMap.getFlavorsForNative and SunToolkit.awtLock
JDK-8020443client-libsjava.awtFrame is not created on the specified GraphicsDevice with two monitors
JDK-8039926client-libsjava.awt-spash:<image> can't be combined with -xStartOnFirstThread since JDK 7
JDK-8042585client-libsjava.awt[macosx] Unused code in LWCToolkit.m
JDK-8043393client-libsjava.awtNullPointerException and no event received when clipboard data flavor changes
JDK-8056151client-libsjava.awtSwitching to GTK L&F on-the-fly leads to X Window System error RenderBadPicture
JDK-8056915client-libsjava.awtFocus lost in applet when browser window is minimized and restored
JDK-8058930client-libsjava.awtGraphicsEnvironment.getHeadlessProperty() does not work for AIX
JDK-8061636client-libsjava.awtFix for JDK-7079254 changes behavior of MouseListener, MouseMotionListener
JDK-8064934client-libsjava.awtIncorrect Exception message from java.awt.Desktop.open()
JDK-8068886client-libsjava.awtIDEA IntelliJ crashes in objc_msgSend when an accessibility tool is enabled
JDK-8071306client-libsjava.awtGUI perfomance are very slow compared java 1.6.0_45
JDK-8072069client-libsjava.awtToolkit.getScreenInsets() doesn't update if insets change
JDK-8072088client-libsjava.awt[PIT] NPE in DnD tests apparently because of the fix to JDK-8061636
JDK-8072769client-libsjava.awtSystem tray icon title freezes java
JDK-8072775client-libsjava.awtTremendous memory usage by JTextArea
JDK-8073008client-libsjava.awtpress-and-hold input method for accented characters works incorrectly on OS X
JDK-8073453client-libsjava.awtFocus doesn't move when pressing Shift + Tab keys
JDK-8074500client-libsjava.awtjava.awt.Checkbox.setState() call causes ItemEvent to be filed
JDK-8074921client-libsjava.awtOS X build broken by reference to XToolkit
JDK-8075609client-libsjava.awtjava.lang.IllegalArgumentException: aContainer is not a focus cycle root of aComponent
JDK-8076106client-libsjava.awt[macosx] Drag image of TransferHandler does not honor MultiResolutionImage
JDK-8077409client-libsjava.awtDrawing deviates when validate() is invoked on java.awt.ScrollPane
JDK-8077686client-libsjava.awtOperationTimedOut exception inside from XToolkit.syncNativeQueue call on Ubuntu 15.04
JDK-8078149client-libsjava.awt[macosx] The text of the TextArea is not wrapped at word boundaries
JDK-8078165client-libsjava.awt[macosx] NPE when attempting to get image from toolkit
JDK-8078606client-libsjava.awtDeadlock in awt clipboard
JDK-8080137client-libsjava.awtDragged events for extra mouse buttons (4,5,6) are not generated on JSplitPane
JDK-8081371client-libsjava.awt[PIT] Test closed/java/awt/FullScreen/DisplayMode/CycleDMImage.java switches Linux to the single device mode
JDK-8130752client-libsjava.awtWrong changes were pushed with 8068886
JDK-8132382client-libsjava.awt[macosx] Crash during JMC or JavaFX execution when NSApplication is controlled by SWT or JavaFX libraries
JDK-8076455client-libsjava.awt:i18nIME Composition Window is displayed on incorrect position
JDK-8067657client-libsjava.beansDead/outdated links in Javadoc of package java.beans
JDK-8069268client-libsjavax.accessibilityJComponent.AccessibleJComponent.addPropertyListeners adds exponential listeners
JDK-8076182client-libsjavax.accessibilityOpen Source Java Access Bridge - Create Patch for JEP C127 8055831
JDK-8078408client-libs Java version applet hangs with Voice over turned on
JDK-4952954client-libs abort flag is not cleared for every write operation for JPEG ImageWriter
JDK-4958064client-libsjavax.imageioJPGWriter does not throw UnsupportedException when canWriteSequence retunsfalse
JDK-8074954client-libsjavax.imageioImageInputStreamImpl.readShort/readIntdo not behave correctly at EOF
JDK-8068412client-libsjavax.sound[macosx] Initialization of Cocoa hangs if CoreAudio was initialized before
JDK-6206437client-libsjavax.swingTypo in JInternalFrame setDefaultCloseOperation() doc (WindowClosing --> internalFrameClosing)
JDK-6338077client-libsjavax.swinglink back to self in javadoc JTextArea.replaceRange()
JDK-6459798client-libsjavax.swingJDesktopPane,JFileChooser violate encapsulation by returning internal Dimensions
JDK-6459800client-libsjavax.swingSome Swing classes violate encapsulation by returning internal Insets
JDK-6470361client-libsjavax.swingSwing's Threading Policy example does not compile
JDK-6515713client-libsjavax.swingexample in JFormattedTextField API docs instantiates abstract class
JDK-6573305client-libsjavax.swingAnimated icon is not visible by click on menu
JDK-7180976client-libsjavax.swingPending String deadlocks UIDefaults
JDK-8013820client-libsjavax.swingJavaDoc for JSpinner contains errors
JDK-8015085client-libsjavax.swing[macosx] Label shortening via " ... " broken when String contains combining diaeresis
JDK-8033000client-libsjavax.swingNo Horizontal Mouse Wheel Support In BasicScrollPaneUI
JDK-8033069client-libsjavax.swingmouse wheel scroll closes combobox popup
JDK-8041470client-libsjavax.swingJButtons stay pressed after they have lost focus if you use the mouse wheel
JDK-8041642client-libsjavax.swingIncorrect paint of JProgressBar in Nimbus LF
JDK-8041654client-libsjavax.swingOutOfMemoryError: RepaintManager doesn't clean up cache of volatile images
JDK-8044444client-libsjavax.swingThe output's 'Page-n' footer does not show completely.
JDK-8048289client-libsjavax.swingGtk: call to UIManager.getSystemLookAndFeelClassName() leads to crash
JDK-8051617client-libsjavax.swingFullscreen mode is not working properly on Xorg
JDK-8064939client-libsjavax.swingSwingSet2: Themes are incorrectly enabled when running with Nimbus Look and feel
JDK-8068040client-libsjavax.swing[macosx] Combo box consuming ENTER key events
JDK-8071705client-libsjavax.swingJava application menu misbehaves when running multiple screen stacked vertically
JDK-8072448client-libsjavax.swingCan not input Japanese in JTextField on RedHat Linux
JDK-8072676client-libsjavax.swing[macosx] Jtree icon painted over label when scrollbars present in window
JDK-8072900client-libsjavax.swing[macosx] Mouse events are captured by the wrong menu in OS X
JDK-8073795client-libsjavax.swingJMenuBar looks bad under retina
JDK-8074956client-libsjavax.swingArrayIndexOutOfBoundsException in javax.swing.text.html.parser.ContentModel.first()
JDK-8080628client-libsjavax.swingNo mnemonics on Open and Save buttons in JFileChooser
JDK-8066504core-libs GetVersionEx in java.base/windows/native/libjava/java_props_md.c might not get correct Windows version
JDK-8068580core-libs JavaAdapterFactory.isAutoConvertibleFromFunction should be more robust
JDK-8074657core-libs Missing space on a boundary of concatenated strings
JDK-8081674core-libs EmptyStackException at startup if running with extended or unsupported charset
JDK-8098547core-libs (tz) Support tzdata2015e
JDK-8065372core-libsjava.langObject.wait(ms, ns) timeout returns early
JDK-8067471core-libsjava.langUse private static final char[0] for empty Strings
JDK-8067748core-libsjava.lang(process) Child is terminated when parent's console is closed [win]
JDK-8069302core-libsjava.langDeprecate Unsafe monitor methods in JDK 8u release
JDK-8059455core-libsjava.lang.invokeLambdaForm.prepare() does unnecessary work for cached LambdaForms
JDK-8063137core-libsjava.lang.invokeNever taken branches should be pruned when GWT LambdaForms are shared
JDK-8069591core-libsjava.lang.invokeCustomize LambdaForms which are invoked using MH.invoke/invokeExact
JDK-8071788core-libsjava.lang.invokeCountingWrapper.asType() is broken
JDK-8077054core-libsjava.lang.invokeDMH LFs should be customizeable
JDK-8078290core-libsjava.lang.invokeCustomize adapted MethodHandle in MH.invoke() case
JDK-8064846core-libsjava.lang:reflectLazy-init thread safety problems in core reflection
JDK-8066842core-libsjava.mathjava.math.BigDecimal.divide(BigDecimal, RoundingMode) produces incorrect result
JDK-8065994core-libsjava.netHTTP Tunnel connection to NTLM proxy reauthenticates instead of using keep-alive
JDK-8067680core-libsjava.net(sctp) Possible race initializing native IDs
JDK-8067846core-libsjava.net(sctp) InternalError when receiving SendFailedNotification
JDK-8068028core-libsjava.netJNI exception pending in jdk/src/solaris/native/java/net
JDK-8068795core-libsjava.netHttpServer missing tailing space for some response codes
JDK-8072384core-libsjava.netSetting IP_TOS on java.net sockets not working on unix
JDK-8077155core-libsjava.netLoginContext Subject ignored by jdk8 sun.net.www.protocol.http.HttpURLConnection
JDK-8080819core-libsjava.netInet4AddressImpl regression caused by JDK-7180557
JDK-8064407core-libsjava.nio(fc) FileChannel transferTo should use TransmitFile on Windows
JDK-8068507core-libsjava.nio(fc) Rename the new jdk.net.enableFastFileTransfer system property to jdk.nio.enableFastFileTransfer
JDK-8071599core-libsjava.nio(so) Socket adapter sendUrgentData throws IllegalBlockingMode when channel configured non-blocking
JDK-8071447core-libsjava.nio.charsetsIBM1166 Locale Request for Kazakh characters
JDK-8080248core-libsjava.nio.charsetsCoding regression in HKSCS charsets
JDK-8081479core-libsjava.sqlBackport JDBC tests from JDK 9 from test/java/sql and test/javax/sql to JDK 8u.
JDK-8074791core-libsjava.textLong-form date format incorrect month string for Finnish locale
JDK-8075173core-libsjava.textDateFormat in german locale returns wrong value for month march
JDK-8034906core-libsjava.timeFix typos, errors and Javadoc differences in java.time
JDK-8062796core-libsjava.timejava.time.format.DateTimeFormatter error in API doc example
JDK-8062803core-libsjava.timeprincipal' should be 'principle' in java.time package description
JDK-8075676core-libsjava.timejava.time package javadoc typos
JDK-8075678core-libsjava.timejava.time javadoc error in DateTimeFormatter::parsedLeapSecond
JDK-8081022core-libsjava.timejava/time/test/java/time/format/TestZoneTextPrinterParser.java fails by timeout on slow device
JDK-8068790core-libsjava.utilZipEntry/JarEntry.setCreation/LastAccessTime(null) don't throw NPE as specified
JDK-8072909core-libsjava.utilTimSort fails with ArrayIndexOutOfBoundsException on worst case long arrays
JDK-8068432core-libsjava.util.concurrentInconsistent exception handling in CompletableFuture.thenCompose
JDK-8078490core-libsjava.util.concurrentMissed submissions in ForkJoinPool
JDK-8080623core-libsjava.util.concurrentCPU overhead in FJ due to spinning in awaitWork
JDK-8085978core-libsjava.util.concurrentLinkedTransferQueue<T>.spliterator can report LTQ.Node object, not T
JDK-8068338core-libsjava.util.jarBetter message about incompatible zlib in Deflater.init
JDK-8073497core-libsjava.util.jarLazy conversion of ZipEntry time
JDK-8076641core-libsjava.util.jargetNextEntry throws ArrayIndexOutOfBoundsException when unzipping file
JDK-8129120core-libsjava.util.streamTerminal operation properties should not be back-propagated to upstream operations
JDK-7044727core-libsjava.util:i18n(tz) TimeZone.getDefault() call returns incorrect value in Windows terminal session
JDK-8055088core-libsjava.util:i18nOptimization for locale resources loading isn't working
JDK-8072602core-libsjava.util:i18nUnpredictable timezone on Windows when OS's timezone is not found in tzmappings
JDK-8074350core-libsjava.util:i18nSupport ISO 4217 "Current funds codes" table (A.2)
JDK-8075548core-libsjava.util:i18nSimpleDateFormat formatting of "LLLL" in English is incorrect; should be identical to "MMMM"
JDK-8076287core-libsjava.util:i18nPerformance degradation observed with TimeZone Benchmark
JDK-6991580core-libsjavax.namingIPv6 Nameservers in resolv.conf throws NumberFormatException
JDK-7011441core-libsjavax.naming./jndi/ldap/Connection.java needs to avoid spurious wakeup
JDK-8074761core-libsjavax.namingEmpty optional parameters of LDAP query are not interpreted as empty
JDK-8062030core-libsjavax.scriptNashorn bug retrieving array property after key string concatenation
JDK-8068279core-libsjavax.script(typo in the spec) javax.script.ScriptEngineFactory.getLanguageName
JDK-8068462core-libsjavax.scriptjavax.script.ScriptEngineFactory.getParameter spec is not completely consistent with the rest of the API
JDK-8068872core-libsjavax.scriptNashorn JSON.parse drops numeric keys
JDK-8071928core-libsjavax.scriptInstance properties with getters returning wrong values
JDK-8072002core-libsjavax.scriptThe spec on javax.script.Compilable contains a typo and confusing inconsistency
JDK-8073846core-libsjavax.scriptJavascript for-in loop returned extra keys
JDK-8059411core-libsjavax.sqlRowSetWarning does not correctly chain warnings
JDK-8062198core-libsjavax.sqlAdd RowSetMetaDataImpl Tests and add column range validation to isdefinitlyWritable
JDK-8066188core-libsjavax.sqlBaseRowSet returns the wrong default value for escape processing
JDK-8007456core-libsjdk.nashornNashorn test framework @argument does not handle quoted strings
JDK-8012190core-libsjdk.nashornGlobal scope should be initialized lazily
JDK-8035712core-libsjdk.nashornInvestigate if RuntimeCallSite linkage can be removed
JDK-8049300core-libsjdk.nashornjjs scripting: need way to quote $EXEC command arguments to protect spaces
JDK-8053905core-libsjdk.nashornEager code generation fails for earley boyer with split threshold set to 1000
JDK-8066407core-libsjdk.nashornFunction with same body not reparsed after SyntaxError
JDK-8066773core-libsjdk.nashornJSON-friendly wrapper for objects
JDK-8067139core-libsjdk.nashornFinally blocks inlined incorrectly
JDK-8067215core-libsjdk.nashornDisable dual fields when not using optimistic types
JDK-8067420core-libsjdk.nashornBrowserJSObjectLinker should give priority to beans linker for property get/set
JDK-8067636core-libsjdk.nashornant javadoc target is broken
JDK-8067774core-libsjdk.nashornLocal variable type calculation mismatch
JDK-8067854core-libsjdk.nashornbound java static method throws NPE when 'null' is used for this argument
JDK-8067880core-libsjdk.nashornDead typed push methods in ArrayData
JDK-8067931core-libsjdk.nashornImprove error message when with statement is passed a POJO
JDK-8068431core-libsjdk.nashorn@since and @jdk.Exported are missing in jdk.nashorn.api.scripting classes and package-info.java files
JDK-8068524core-libsjdk.nashornNashornScriptEngineFactory.getParameter() throws IAE for an unknown key, doesn't conform to the general spec
JDK-8068603core-libsjdk.nashornNashornScriptEngine.put/get() impls don't conform to NPE, IAE spec assertions
JDK-8068784core-libsjdk.nashornHalve the function object creation code size
JDK-8068985core-libsjdk.nashornWrong 'this' bound to eval call within a function when caller's 'this' is a Java object
JDK-8071989core-libsjdk.nashornNashornScriptEngine returns javax.script.ScriptContext instance with insonsistent get/remove methods behavior for undefined attributes
JDK-8071991core-libsjdk.nashornBuild errors in 8u-dev after backporting JDK-8067139 and JDK-8066232
JDK-8072000core-libsjdk.nashornNew compiler warning after JDK-8067139
JDK-8072426core-libsjdk.nashornCan't compare Java enums to strings
JDK-8072595core-libsjdk.nashornnashorn should not use obj.getClass() for null checks
JDK-8072596core-libsjdk.nashornArrays.asList results in ClassCastException with a JS array
JDK-8072626core-libsjdk.nashornTest for JDK-8068872 fails in tip
JDK-8072853core-libsjdk.nashornSimpleScriptContext used by NashornScriptEngine doesn't completely complies to the spec regarding exception throwing
JDK-8073707core-libsjdk.nashornconst re-assignment should not reported as a "early error"
JDK-8073868core-libsjdk.nashornRegex matching causes java.lang.ArrayIndexOutOfBoundsException: 64
JDK-8074021core-libsjdk.nashornIndirect eval fails when used as an element of an array or as a property of an object
JDK-8074031core-libsjdk.nashornCanonicalize "is a JS string" tests
JDK-8074410core-libsjdk.nashornStartup time: Port shell.js to Java
JDK-8074484core-libsjdk.nashornMore aggressive value discarding
JDK-8074487core-libsjdk.nashornStatic analysis of IfNode should consider terminating branches
JDK-8074687core-libsjdk.nashornAdd tests for JSON parsing of numeric keys
JDK-8075006core-libsjdk.nashornThreads spinning infinitely in WeakHashMap.get running test262parallel
JDK-8075090core-libsjdk.nashornAdd tests for the basic failure of try/finally compilation
JDK-8075231core-libsjdk.nashornTyped array setters are very slow when index exceeds capacity
JDK-8075366core-libsjdk.nashornSlow scope access to global let/const does not work
JDK-8075604core-libsjdk.nashornjjs exits even when non-daemon threads are still active
JDK-8075927core-libsjdk.nashorntoNumber(String) accepts illegal characters
JDK-8076646core-libsjdk.nashornnashorn tests should avoid using package names used by nashorn sources
JDK-8076972core-libsjdk.nashornSeveral nashorn tests failing
JDK-8077955core-libsjdk.nashornUndeclared globals in eval code should not be handled as fast scope
JDK-8078049core-libsjdk.nashornNashorn crashes when attempting to start TypeScript compiler
JDK-8078414core-libsjdk.nashornDon't create impossible converters for ScriptObjectMirror
JDK-8078612core-libsjdk.nashornPersistent code cache should support more configurations
JDK-8079145core-libsjdk.nashornjdk.nashorn.internal.runtime.arrays.IntArrayData.convert assertion
JDK-8079269core-libsjdk.nashornOptimistic rewrite in object literal causes ArrayIndexOutOfBoundsException
JDK-8079349core-libsjdk.nashornEliminate dead code around Nashorn code generator
JDK-8079362core-libsjdk.nashornEnforce best practices for Node token API usage
JDK-8079424core-libsjdk.nashornCode generator emits an extra POP for discarded boolean logical operation
JDK-8079470core-libsjdk.nashornMisleading error message when explicit signature constructor is called with wrong arguments
JDK-8080087core-libsjdk.nashornNashorn $ENV.PWD is originally undefined
JDK-8080090core-libsjdk.nashorn-d option should dump script source as well
JDK-8080275core-libsjdk.nashorntransparently download testng.jar for Nashorn testing
JDK-8080286core-libsjdk.nashornuse path separator setting consistently in Nashorn project properties
JDK-8080471core-libsjdk.nashornfix usage of replace and file separator in Nashorn tests
JDK-8080490core-libsjdk.nashornadd $EXECV command to Nashorn scripting mode
JDK-8080598core-libsjdk.nashornJavadoc warnings in Global.java after lazy initialization
JDK-8080848core-libsjdk.nashorndelete of bound Java method property results in crash
JDK-8081015core-libsjdk.nashornAllow conversion of native arrays to Queue and Collection
JDK-8081062core-libsjdk.nashornListAdapter should take advantage of JSObject
JDK-8081156core-libsjdk.nashornjjs "nashorn.args" system property is not effective when script arguments are passed
JDK-8081204core-libsjdk.nashornListAdapter throws NPE when adding/removing elements outside of JS context
JDK-8081603core-libsjdk.nashornerroneous dot file generated from Nashorn --print-code
JDK-8081604core-libsjdk.nashornrename ScriptingFunctions.tokenizeCommandLine
JDK-8081609core-libsjdk.nashornengine.eval call from a java method which was called from a previous engine.eval results in wrong ScriptContext being used.
JDK-8081668core-libsjdk.nashornfix Nashorn ant externals command
JDK-8081696core-libsjdk.nashornreduce dependency of Nashorn tests on external components
JDK-8081809core-libsjdk.nashornMissing final modifier in method parameters (nashorn code convention)
JDK-8081813core-libsjdk.nashornJSONListAdapter should delegate its [[DefaultValue]] to wrapped object
JDK-8085802core-libsjdk.nashornNashorn -nse option causes parse error on anonymous function definition
JDK-8085810core-libsjdk.nashornReturn value of Objects.requireNonNull call can be used
JDK-8085885core-libsjdk.nashornaddress Javadoc warnings in Nashorn source code
JDK-8085937core-libsjdk.nashornadd autoimports sample script to easily explore Java classes in interactive mode
JDK-8087136core-libsjdk.nashornregression: apply on $EXEC fails with ClassCastException
JDK-8087211core-libsjdk.nashornIndirect evals should be strict with -strict option
JDK-8098546core-libsjdk.nashorneval within a 'with' leaks definitions into global scope
JDK-8098578core-libsjdk.nashornGlobal scope is not accessible with indirect load call
JDK-8098807core-libsjdk.nashornStrict eval throws ClassCastException with large scripts
JDK-8098808core-libsjdk.nashornConvert Scope from interface to class
JDK-8098847core-libsjdk.nashornobj."prop" and obj.'prop' should result in SyntaxError
JDK-8117883core-libsjdk.nashornnasgen prototype, instance member count calculation is wrong
JDK-8129410core-libsjdk.nashornJava adapters with class-level overrides should preserve variable arity constructors
JDK-4505697core-svcdebuggernsk/jdi/ExceptionEvent/_itself_/exevent006 and exevent008 tests fail with InvocationTargetException
JDK-8071657core-svcdebuggerJDI ObjectReferenceImpl.invokeMethod() validation fails for virtual invocations of method with declaring type being an interface
JDK-6712222core-svcjava.lang.managementRace condition in java/lang/management/ThreadMXBean/AllThreadIds.java
JDK-8048050core-svcjavax.managementAgent NullPointerException when rmi.port in use
JDK-8064331core-svcjavax.managementJavaSecurityAccess.doIntersectionPrivilege() drops the information about the domain combiner of the stack ACC
JDK-8071687core-svctoolsAIX port of "8039173: Propagate errors from Diagnostic Commands as exceptions in the attach framework"
JDK-6554593deploy Java Control Panel accessibility problem with labels and text fields
JDK-7017683deploy java.com link in some of the dialogs are not accessible
JDK-8023324deploy With expired or selfsigned DeploymentRuleSet, not hint is provied in JCP Rule Set dialog.
JDK-8024156deploy DRS: The messaging for invalid rule set jar is not explicit.
JDK-8046790deploy echo <customer> elements in ruleset.xml
JDK-8047698deploy Clicking cancel on security dialog for preloader clears the DeniedCertStore
JDK-8049999deploy DRS: Want customizable message in case of application blocking if only default rule is specified
JDK-8067171deploy [parfait] File Handle Leak in configcache_pd.c
JDK-8068456deploy Revert project file accidentally pushed
JDK-8069275deploy The text location of "More information" overlap with "code" in mixed code dialog
JDK-8072431deploy Unit test failures: JNLPClassloaderTest, JNLP2ClassLoaderTest
JDK-8074105deploy Remove support for downloaded JavaFX classes
JDK-8074402deploy Add DRS rules <customer> block to Java Usage Tracker records.
JDK-8074961deploy Ensure JFR options could be passed to webstart app by specifying VM arguments in the JCP
JDK-8078534deploy DRS 1.2: checksum algorithm needs to be restricted to SHA-256
JDK-8022268deploydeployment_toolkitDRS: Unable to include escaped characters in message
JDK-8075179deploydeployment_toolkitTest jnlp_file/applicationDesc/index.html#args fails with incorrect arg value
JDK-8131321deploypackager8u60 Windows 64-bit packager - install succeeds but application fails to start
JDK-8035582deploypluginDeploymentRuleSet <message> on run action
JDK-8058474deploypluginApplet is not started in IE on dynamic insertion into a web page
JDK-8059622deploypluginJava Console GUI is irresponsive in JRE 8u20 on OS X
JDK-8061642deploypluginPlugin missing MIME type registration for application/x-java-applet;version=1.8
JDK-8069161deploypluginSlow cache performance since JRE 7u06
JDK-8074481deployplugin[macosx] Menu items are appearing on top of other windows
JDK-8074482deployplugin[macosx] Menu items disappear and redrawn quickly when moving mouse into applet frame
JDK-8077855deploypluginWhen applet is relaunched, extra JUT records can be sent
JDK-8079677deploypluginfix to JDK-8078534 removed part of fix to JDK-8076220
JDK-8080123deploypluginStringIndexOutOfBoundsException in CertUtils.checkWildcardDomain
JDK-8080955deploypluginembedded_jnlp param requires also code or jnlp_href param or applet arg.
JDK-8081330deploypluginThe applet thrown NullPointerException when loading it
JDK-8042632deploywebstartApplication with Signed JNLP cannot pass accented characters in <argument>
JDK-8051030deploywebstartWeb Start applet process fails to exit
JDK-8066985deploywebstartJava Webstart downloading packed files can result in Timezone set to UTC
JDK-8067172deploywebstartXcode javaws Project to Debug Native Code
JDK-8068187deploywebstartFix Xcode project
JDK-8068531deploywebstartNetbeans javaws Project to Debug Native Code
JDK-8068939deploywebstartVisual Studio javaws Project to Debug Native Code
JDK-8072003deploywebstartNPE (instead of proper error dialog) thrown when some jnlp files have no resources
JDK-8072999deploywebstartDRS certificate based rule does not match with Java WS Application compressed by pack200
JDK-8077285deploywebstartjnlp spec version 8.20 is not supported
JDK-8077649deploywebstartjnlp "codebase" attribute has been made mandatory
JDK-8077925deploywebstartJnlp fails to load with CouldNotLoadArgumentException after JDK-8075179
JDK-8078893deploywebstartcert based run rule doesn't work when running offline
JDK-8080607deploywebstartWeb Start does not honor height / width % values
JDK-8080785deploywebstartremove dead code to donwload JavaFX on demand.
JDK-8080774globalization DateFormat for Singapore/English locale (en_SG) is M/d/yy instead of d/M/yy
JDK-8072453globalizationtranslation[de,fr,pt_BR,sv] duplicate mnemonics in JCP security tab.
JDK-8072589globalizationtranslation[windows 8] S. Chinese quotation mark needs to be replaced by English quotation mark
JDK-8079361globalizationtranslationBroken Localization Strings (XMLSchemaMessages_de.properties)
JDK-8083601globalizationtranslationjdk8u60 l10n resource file translation update 2
JDK-8075798hotspot Allow ADLC register class to depend on runtime conditions also for cisc-spillable classes
JDK-8006960hotspotcompilerhotspot, "impossible" assertion failure
JDK-8036851hotspotcompilervolatile double accesses are not explicitly atomic in C2
JDK-8036913hotspotcompilermake DeoptimizeALot dependent on number of threads
JDK-8037140hotspotcompilerC1: Incorrect argument type used for SharedRuntime::OSR_migration_end in LIRGenerator::do_Goto
JDK-8060036hotspotcompilerC2: CmpU nodes can end up with wrong type information
JDK-8062280hotspotcompilerC2: inlining failure due to access checks being too strict
JDK-8062591hotspotcompilerSPARC PICL causes significantly longer startup times
JDK-8065915hotspotcompilerFix includes after 8058148: MaxNodeLimit and LiveNodeCountInliningCutoff
JDK-8068881hotspotcompilerSIGBUS in C2 compiled method weblogic.wsee.jaxws.framework.jaxrpc.EnvironmentFactory$SimulatedWsdlDefinitions.<init>
JDK-8068909hotspotcompilerSIGSEGV in c2 compiled code with OptimizeStringConcat
JDK-8068915hotspotcompilerC2: uncommon trap w/ Reason_speculate_class_check causes performance regression due to continuous deoptimizations
JDK-8068945hotspotcompilerUse RBP register as proper frame pointer in JIT compiled code on x86
JDK-8069263hotspotcompilerassert(fm == NULL || fm->method_holder() == _participants[n]) failed: sanity
JDK-8071302hotspotcompilerassert(!_reg_node[reg_lo] || edge_from_to(_reg_node[reg_lo],def)) failed: after block local scheduling
JDK-8071534hotspotcompilerassert(!failing()) failed: Must not have pending failure. Reason is: out of memory
JDK-8072383hotspotcompilerresolve conflicts between open and closed ports
JDK-8072753hotspotcompilerNondeterministic wrong answer on arithmetic
JDK-8074548hotspotcompilerNever-taken branches cause repeated deopts in MHs.GWT case
JDK-8074551hotspotcompilerGWT can be marked non-compilable due to deopt count pollution
JDK-8074869hotspotcompilerC2 code generator can replace -0.0f with +0.0f on Linux
JDK-8075587hotspotcompilerCompilation of constant array containing different sub classes crashes the JVM
JDK-8076523hotspotcompilerassert(((ABS(iv_adjustment_in_bytes) % elt_size) == 0)) fails in superword.cpp
JDK-8077504hotspotcompilerUnsafe load can loose control dependency and cause crash
JDK-8078113hotspotcompiler8011102 changes may cause incorrect results.
JDK-8078482hotspotcompilerppc: pass thread to throw_AbstractMethodError
JDK-8078497hotspotcompilerC2's superword optimization causes unaligned memory accesses
JDK-8078666hotspotcompilerJVM fastdebug build compiled with GCC 5 asserts with "widen increases"
JDK-8078866hotspotcompilercompiler/eliminateAutobox/6934604/TestIntBoxing.java assert(p_f->Opcode() == Op_IfFalse) failed
JDK-8079343hotspotcompilerCrash in PhaseIdealLoop with "assert(!had_error) failed: bad dominance"
JDK-8080012hotspotcompilerJVM times out with vdbench on SPARC M7-16
JDK-8080156hotspotcompilerInteger.toString(int value) sometimes throws NPE
JDK-8080190hotspotcompilerPPC64: Fix wrong rotate instructions in the .ad file
JDK-8080281hotspotcompiler8068945 changes break building the zero JVM variant
JDK-7176220hotspotgcFull GC' events miss date stamp information occasionally
JDK-8027962hotspotgcPer-phase timing measurements for strong roots processing
JDK-8031686hotspotgcG1: assert(_hrs.max_length() == _expansion_regions) failed
JDK-8033440hotspotgcjmap reports unexpected used/free size of concurrent mark-sweep generation
JDK-8048179hotspotgcEarly reclaim of large objects that are referenced by a few objects
JDK-8049536hotspotgcos::commit_memory on Solaris uses aligment_hint as page size
JDK-8049864hotspotgcTestParallelHeapSizeFlags fails with unexpected heap size
JDK-8051837hotspotgcRemove temporary G1UseParallelRSetUpdating and G1UseParallelRSetScanning flags
JDK-8053998hotspotgcHot card cache flush chunk size too coarse grained
JDK-8057037hotspotgcVerification in ClassLoaderData::is_alive is too slow
JDK-8058354hotspotgcSPECjvm2008-Derby -2.7% performance regression on Solaris-X64 starting with 9-b29
JDK-8058801hotspotgcG1TraceReclaimDeadHumongousObjectsAtYoungGC only prints humongous object liveness output when there is at least one candidate humongous object
JDK-8060025hotspotgcObject copy time regressions after JDK-8031323 and JDK-8057536
JDK-8061259hotspotgcParNew promotion failed is serialized on a lock
JDK-8061630hotspotgcG1 iterates over JNIHandles two times
JDK-8062672hotspotgcJVM crashes during GC on various asserts which checks that HeapWord ptr is an oop
JDK-8064473hotspotgcImproved handling of age during object copy in G1
JDK-8065358hotspotgcRefactor G1s usage of save_marks and reduce related races
JDK-8066771hotspotgcRefactor VM GC operations caused by allocation failure
JDK-8067469hotspotgcG1 ignores AlwaysPreTouch
JDK-8067655hotspotgcClean up G1 remembered set oop iteration
JDK-8068036hotspotgcassert(is_available(index)) failed in G1 cset
JDK-8069273hotspotgcDecrease Hot Card Cache Lock contention
JDK-8069367hotspotgcEagerly reclaimed humongous objects left on mark stack
JDK-8069760hotspotgcWhen iterating over a card, G1 often iterates over much more references than are contained in the card
JDK-8073944hotspotgcSimplify ArgumentsExt and remove unneeded functionallity
JDK-8074037hotspotgcRefactor the G1GCPhaseTime logging to make it easier to add new phases
JDK-8074561hotspotgcWrong volatile qualifier for field ClassLoaderDataGraphKlassIteratorAtomic::_next_klass
JDK-8075210hotspotgcRefactor strong root processing in order to allow G1 to evolve separately from GenCollectedHeap
JDK-8075215hotspotgcSATB buffer processing found reclaimed humongous object
JDK-8075466hotspotgcSATB queue pre-filter verify found reclaimed humongous object
JDK-8076265hotspotgcSimplify deal_with_reference
JDK-8077255hotspotgcTracePageSizes output reports wrong page size on Windows with G1
JDK-8078021hotspotgcSATB apply_closure_to_completed_buffer should have closure argument
JDK-8078023hotspotgcverify_no_cset_oops found reclaimed humongous object in SATB buffer
JDK-8085965hotspotgcVM hangs in C2Compiler
JDK-8086111hotspotgcBACKOUT - metaspace/shrink_grow/CompressedClassSpaceSize fails with OOM: Compressed class space
JDK-8087200hotspotgcCode heap does not use large pages
JDK-8129108hotspotgcnmethod related crash in CMS
JDK-6584008hotspotjvmtijvmtiStringPrimitiveCallback should not be invoked when string value is null
JDK-8013942hotspotjvmtiJSR 292: assert(type() == T_OBJECT) failed: type check
JDK-8042796hotspotjvmtijvmtiRedefineClasses.cpp: guarantee(false) failed: OLD and/or OBSOLETE method(s) found
JDK-8046246hotspotjvmtithe constantPoolCacheOopDesc::adjust_method_entries() used in RedefineClasses does not scale
JDK-8067662hotspotjvmti"java.lang.NullPointerException: Method name is null" from StackTraceElement.<init>
JDK-8073705hotspotjvmtimore performance issues in class redefinition
JDK-8076579hotspotjvmtiPopping a stack frame after exception breakpoint sets last method param to exception
JDK-6536943hotspotruntimeBogus -Xcheck:jni warning for SIG_INT action for SIGINT in JVM started from non-interactive shell
JDK-7127066hotspotruntimeClass verifier accepts an invalid class file
JDK-8027914hotspotruntimeClient JVM silently exit with fail exit code when running in compact(1,2) with options -Dcom.sun.management and -XX:+ManagementServer
JDK-8043224hotspotruntime-Xcheck:jni improvements to exception checking and excessive local refs
JDK-8046668hotspotruntimeExcessive checked JNI warnings from Java startup
JDK-8047382hotspotruntimehotspot build failed with gcc version Red Hat 4.4.6-4
JDK-8051045hotspotruntimeHotSpot fails to wrap Exceptions from invokedynamic in a BootstrapMethodError
JDK-8053995hotspotruntimeAdd method to WhiteBox to get vm pagesize.
JDK-8055231hotspotruntimeZERO variant build is broken
JDK-8058345hotspotruntimeRefactor native stack printing from vmError.cpp to debug.cpp to make it available in gdb as well
JDK-8058935hotspotruntimeCPU detection gives 0 cores per cpu, 2 threads per core in Amazon EC2 environment
JDK-8064815hotspotruntimeZero+PPC64: Stack overflow when running Maven
JDK-8066875hotspotruntimeVirtualSpace does not use large pages
JDK-8067231hotspotruntimeZero builds fails after JDK-6898462
JDK-8067331hotspotruntimeZero: Atomic::xchg and Atomic::xchg_ptr need full memory barrier
JDK-8069412hotspotruntimeLocks need better debug-printing support
JDK-8071501hotspotruntimeperfMemory_solaris.cpp failing to compile with "Error: dd_fd is not a member of DIR."
JDK-8072588hotspotruntimeJVM crashes in JNI if toString is declared as an interface method
JDK-8072863hotspotruntimeReplace fatal() with vm_exit_during_initialization() when an incorrect class is found on the bootclasspath
JDK-8075118hotspotruntimeJVM stuck in infinite loop during verification
JDK-8076212hotspotruntimeAllocateHeap() and ReallocateHeap() should be inlined.
JDK-8077674hotspotruntimeBSD build failures due to undefined macros
JDK-8078470hotspotruntime[Linux] Replace syscall use in os::fork_and_exec with glibc fork() and execve()
JDK-8025636hotspotsvcHide lambda proxy frames in stacktraces
JDK-8044416hotspotsvcserviceability/sa/jmap-hashcode/Test8028623.java fails with AssertionFailure: can not get class data for java/lang/UNIXProcess$Platform$$Lambda
JDK-8044531hotspotsvcEvent based tracing locks to rank as leafs where possible
JDK-8046282hotspotsvcSA update
JDK-8049881hotspotsvcjstack not working on core files
JDK-8053902hotspotsvcFix for 8030115 breaks build on Windows and Solaris
JDK-8069030hotspotsvcsupport new PTRACE_GETREGSET
JDK-8072932hotspotsvcTest fails with java.security.AccessControlException: access denied ("java.security.SecurityPermission" "getDomainCombiner")
JDK-8073688hotspotsvcInfinite loop reading types during jmap attach.
JDK-8075331hotspotsvcjdb eval java.util.Arrays.asList(array) shows inconsistent behaviour
JDK-8081475hotspotsvcSystemTap does not work when JDK is compiled with GCC 5
JDK-8080600hotspottestAARCH64: testlibrary does not support AArch64
JDK-8067630install [mac os x] Update '3 Billion Devices' Advert on SetupProgress Dialog
JDK-8072868install 8u20 and later should not change the MSI UpgradeCode for each JRE version
JDK-8076982install Create HKLM\SOFTWARE\JavaSoft\Java Runtime Environment\<VERSION> registry keys with msi.
JDK-8078310install [macosx] StagedXML is missing
JDK-8081423install Improve naming consistency in make/installer/bundles/macosx/Makefile
JDK-8056992installauto_update[AU]The auto update window does not read the <moreinfo> tag of au-descriptor.xml file to set the "More information" link
JDK-8058929installauto_update[de, fr, it, ko, pt_BR, sv] Layout issue (truncation) in AUWelcome dialog
JDK-8071490installauto_updateJDK9 nightly build from 01/23 failed
JDK-8071838installauto_updateAdd files skipped from the fix to JDK-8071490 by mistake
JDK-6580611installinstallInstall dialogs look bad on Windows when display is set to high DPI
JDK-6745371installinstallMSI/MST files should be deleted after install
JDK-7198599installinstallIncorrect UninstallString windows register key in JDK 1.6, 1.7 and 8
JDK-8049608installinstallHtmlUI: "Change destination folder" checkbox in WelcomeDialog is not accessible by mouse
JDK-8049614installinstallHtmlUI: checkbox text labels should be clickable
JDK-8072940installinstall8u60 nightly solaris_sparcv9_5.10-product build fails
JDK-8075409installinstalljre8-40 fails to install on SuSE 11.3
JDK-8050123other-libscorbaIncorrect property name documented in CORBA InputStream API
JDK-8068721other-libscorbaRMI-IIOP communication fails when ConcurrentHashMap is passed to remote method
JDK-8081590performance The CDS classlist needs to be updated for 8u60
JDK-8054037security-libsjava.securityImprove tracing for java.security.debug=certpath
JDK-8058547security-libsjava.securityMemory leak in ProtectionDomain cache
JDK-8062264security-libsjava.securityKeychainStore requires non-null password to be supplied when retrieving a private key
JDK-8062552security-libsjava.securitySupport keystore type detection for JKS and PKCS12 keystores
JDK-8077418security-libsjava.securityStackOverflowError during PolicyFile lookup
JDK-8079129security-libsjava.securityNullPointerException in PKCS#12 Keystore in PKCS12KeyStore.java
JDK-7065233security-libsjavax.cryptoTo interpret case-insensitive string locale independently
JDK-8069072security-libsjavax.cryptoImprove GHASH performance
JDK-8080102security-libsjavax.cryptoJava 8 cannot load its cacerts in FIPS. no such provider: SunEC
JDK-8062170security-libsjavax.crypto:pkcs11java.security.ProviderException: Error parsing configuration with space
JDK-8055207security-libsjavax.net.sslkeystore and truststore debug output could be much better
JDK-8059588security-libsjavax.net.ssldeadlock in java/io/PrintStream when verbose java.security.debug flags are set
JDK-8072385security-libsjavax.net.sslOnly the first DNSName entry is checked for endpoint identification
JDK-8076221security-libsjavax.net.sslDisable RC4 cipher suites
JDK-8077102security-libsorg.ietf.jgss:krb5dns_lookup_realm should be false by default
JDK-8068937tools jdeps shows "not found" if target class has no reference other than its own package
JDK-8080815tools Update 8u jdeps list of internal APIs
JDK-8028389toolsjavacNullPointerException compiling annotation values that have bodies
JDK-8037546toolsjavacjavac -parameters does not emit parameter names for lambda expressions
JDK-8039262toolsjavacJava compiler performance degradation jdk1.7 vs. jdk1.6 should be amended
JDK-8054220toolsjavacDebugger doesn't show variables *outside* lambda
JDK-8055963toolsjavacInference failure with nested invocation
JDK-8058227toolsjavacDebugger has no access to outer variables inside Lambda
JDK-8061778toolsjavacWrong LineNumberTable for default constructors
JDK-8064803toolsjavacJavac erroneously uses instantiated signatures when merging abstract most-specific methods
JDK-8064857toolsjavacjavac generates LVT entry with length 0 for local variable
JDK-8066808toolsjavaclangtools/test/Makefile should not use OS-specific jtreg binary
JDK-8068489toolsjavacremove unnecessary complexity in Flow and Bits, after JDK-8064857
JDK-8068517toolsjavacCompiler may generate wrong InnerClasses attribute for static enum reference
JDK-8068639toolsjavacMake certain annotation classfile warnings opt-in
JDK-8069181toolsjavacjava.lang.AssertionError when compiling JDK 1.4 code in JDK 8
JDK-8069545toolsjavacjavac, shouldn't check nested stuck lambdas during overload resolution
JDK-8073372toolsjavacRedundant CONSTANT_Class entry not generated for inlined constant
JDK-8075520toolsjavacVarargs access check mishandles capture variables
JDK-8077786toolsjavacCheck varargs access against inferred signature
JDK-8078560toolsjavacThe crash reporting URL listed by javac needs to be updated
JDK-8079613toolsjavacDeeply chained expressions + several overloads + unnecessary inference result in excessive compile times.
JDK-8080842toolsjavacUsing Lambda Expression with name clash results in ClassFormatError
JDK-8072461toolsjavadoc(tool)Table's field width in "Use" page generated by javadoc with '-s' is unbalanced
JDK-8073972toolslauncherDeprecate Multi-Version Java Launcher (mJRE) for JDK8
JDK-8077822toolslauncherjavac does not recognize '*.java' as file if '-J' option is specified
JDK-7156085xmljavax.xml.parsersArrayIndexOutOfBoundsException throws in UTF8Reader of SAXParser
JDK-8062518xmljaxpAIOBE occurs when accessing to document function in extended function in JAXP
JDK-8062924xmljaxpXSL: wrong answer from substring() function
JDK-8081392xmljaxpgetNodeValue should return 'null' value for Element nodes

[8]ページ先頭

©2009-2025 Movatter.jp